{"text_format":"3","workbook":"xlsx","n_sheets":2,"sheets":["시청홈페이지(일반회계)","Sheet1"],"not_rendered":{"external_links":1},"read":"whole","date_system":"1900"}

{"sheet":"시청홈페이지(일반회계)","index":0,"n_rows":68,"n_cols":15,"rows_kept":68,"merged":[[0,0,0,6],[0,7,0,14],[1,0,1,3],[2,0,2,3],[3,0,3,3],[4,0,4,3],[5,0,5,3],[6,0,30,0],[6,1,7,1],[6,2,6,3],[7,2,7,3],[8,1,16,1],[8,2,8,3],[9,2,9,3],[10,2,10,3],[11,2,11,3],[12,2,12,3],[13,2,13,3],[14,2,14,3],[15,2,15,3],[16,2,16,3],[17,1,21,1],[17,2,17,3],[18,2,18,3],[19,2,19,3],[20,2,20,3],[21,2,21,3],[22,1,26,1],[22,2,22,3],[23,2,23,3],[24,2,24,3],[25,2,25,3],[26,2,26,3],[27,2,27,3],[28,1,30,1],[28,2,28,3],[29,2,29,3],[30,2,30,3],[31,0,31,3],[32,0,46,0],[32,1,35,1],[32,2,32,3],[33,2,33,3],[34,2,34,3],[35,2,35,3],[36,2,36,3],[37,1,39,1],[37,2,37,3],[38,2,38,3],[39,2,39,3],[40,1,46,1],[40,2,40,3],[41,2,41,3],[42,2,42,3],[43,2,43,3],[44,2,44,3],[45,2,45,3],[46,2,46,3],[47,0,47,3],[48,0,55,0],[48,2,48,3],[49,2,49,3],[50,2,50,3],[51,1,52,1],[51,2,51,3],[52,2,52,3],[53,2,53,3],[54,2,54,3],[55,2,55,3],[56,0,56,3],[57,2,57,3]]}
["2025년 12월",{"$nulls":6},"지방세외수입 징수보고서(일반회계)"]
["○ 자치단체명 : 전라남도 여수시"]
[{"$nulls":14},"(단위: 원, %)"]
["항목",{"$nulls":3},"ⓐ징수결정액\n(본월분)","①징수결정액\n(누계)","ⓑ수납액\n(본월분)","②수납액\n(누계)","과오납액\n(본월분)","③과오납액\n(누계)","불납결손액\n(본월분)","④불납결손액\n(누계)","미수납액\n(①-②-④)","당월징수율\n(ⓑ/ⓐ)","누적징수율\n(②/①)"]
["합계",{"$nulls":3},{"$f":"E6+E32+E48+E57","v":{"v":5165049756,"d":"5,165,049,756"}},{"$f":"F6+F32+F48+F57","v":{"v":92076080733,"d":"92,076,080,733"}},{"v":5805093474,"d":"5,805,093,474"},{"v":73153129986,"d":"73,153,129,986"},{"v":27212010,"d":"27,212,010"},{"v":177177821,"d":"177,177,821"},{"v":493159440,"d":"493,159,440"},{"v":769342760,"d":"769,342,760"},{"$f":"F5-H5-L5","v":{"v":18153607987,"d":"18,153,607,987"}},{"$f":"ROUND(G5/E5*100,2)","v":112.39},{"$f":"ROUND(H5/F5*100,2)","v":79.45}]
["경상적 세외수입",{"$nulls":3},{"$f":"SUM(E7:E31)","v":{"v":3275189446,"d":"3,275,189,446"}},{"$f":"SUM(F7:F31)","v":{"v":33242396458,"d":"33,242,396,458"}},{"v":3331992764,"d":"3,331,992,764"},{"v":32855300538,"d":"32,855,300,538"},{"v":19264290,"d":"19,264,290"},{"v":71874370,"d":"71,874,370"},0,0,{"$f":"F6-H6-L6","v":{"v":387095920,"d":"387,095,920"}},{"$f":"ROUND(G6/E6*100,2)","v":101.73},{"$f":"ROUND(H6/F6*100,2)","v":98.84}]
[null,"재산임대수입","국유재산임대료",null,{"$f":"VLOOKUP($C7,'[1]징수보고서(지난년도제외)'!$A$3:$O$101,4,FALSE)","v":{"v":-2595930,"d":"(2,595,930)"}},{"$f":"VLOOKUP($C7,'[1]징수보고서(지난년도제외)'!$A$3:$O$101,5,FALSE)","v":{"v":240858100,"d":"240,858,100"}},{"$f":"VLOOKUP($C7,'[1]징수보고서(지난년도제외)'!$A$3:$O$101,6,FALSE)","v":{"v":849860,"d":"849,860"}},{"$f":"VLOOKUP($C7,'[1]징수보고서(지난년도제외)'!$A$3:$O$101,7,FALSE)","v":{"v":239134260,"d":"239,134,260"}},{"$f":"VLOOKUP($C7,'[1]징수보고서(지난년도제외)'!$A$3:$O$101,8,FALSE)","v":0},{"$f":"VLOOKUP($C7,'[1]징수보고서(지난년도제외)'!$A$3:$O$101,9,FALSE)","v":0},{"$f":"VLOOKUP($C7,'[1]징수보고서(지난년도제외)'!$A$3:$O$101,10,FALSE)","v":0},{"$f":"VLOOKUP($C7,'[1]징수보고서(지난년도제외)'!$A$3:$O$101,11,FALSE)","v":0},{"$f":"F7-H7-L7","v":{"v":1723840,"d":"1,723,840"}},{"$f":"ROUND(G7/E7*100,2)","v":-32.74},99.28]
[null,null,"공유재산임대료",null,{"$f":"VLOOKUP($C8,'[1]징수보고서(지난년도제외)'!$A$3:$O$101,4,FALSE)","v":{"v":181358550,"d":"181,358,550"}},{"$f":"VLOOKUP($C8,'[1]징수보고서(지난년도제외)'!$A$3:$O$101,5,FALSE)","v":{"v":900465140,"d":"900,465,140"}},{"$f":"VLOOKUP($C8,'[1]징수보고서(지난년도제외)'!$A$3:$O$101,6,FALSE)","v":{"v":76934790,"d":"76,934,790"}},{"$f":"VLOOKUP($C8,'[1]징수보고서(지난년도제외)'!$A$3:$O$101,7,FALSE)","v":{"v":770777170,"d":"770,777,170"}},{"$f":"VLOOKUP($C8,'[1]징수보고서(지난년도제외)'!$A$3:$O$101,8,FALSE)","v":{"v":14214740,"d":"14,214,740"}},{"$f":"VLOOKUP($C8,'[1]징수보고서(지난년도제외)'!$A$3:$O$101,9,FALSE)","v":{"v":15829450,"d":"15,829,450"}},{"$f":"VLOOKUP($C8,'[1]징수보고서(지난년도제외)'!$A$3:$O$101,10,FALSE)","v":0},{"$f":"VLOOKUP($C8,'[1]징수보고서(지난년도제외)'!$A$3:$O$101,11,FALSE)","v":0},{"v":129687970,"d":"129,687,970"},42.42,85.6]
[null,"사용료수입","도로사용료",null,{"$f":"VLOOKUP($C9,'[1]징수보고서(지난년도제외)'!$A$3:$O$101,4,FALSE)","v":{"v":66200550,"d":"66,200,550"}},{"$f":"VLOOKUP($C9,'[1]징수보고서(지난년도제외)'!$A$3:$O$101,5,FALSE)","v":{"v":2575322870,"d":"2,575,322,870"}},{"$f":"VLOOKUP($C9,'[1]징수보고서(지난년도제외)'!$A$3:$O$101,6,FALSE)","v":{"v":143802570,"d":"143,802,570"}},{"$f":"VLOOKUP($C9,'[1]징수보고서(지난년도제외)'!$A$3:$O$101,7,FALSE)","v":{"v":2444077770,"d":"2,444,077,770"}},{"$f":"VLOOKUP($C9,'[1]징수보고서(지난년도제외)'!$A$3:$O$101,8,FALSE)","v":{"v":78420,"d":"78,420"}},{"$f":"VLOOKUP($C9,'[1]징수보고서(지난년도제외)'!$A$3:$O$101,9,FALSE)","v":{"v":1440070,"d":"1,440,070"}},{"$f":"VLOOKUP($C9,'[1]징수보고서(지난년도제외)'!$A$3:$O$101,10,FALSE)","v":0},{"$f":"VLOOKUP($C9,'[1]징수보고서(지난년도제외)'!$A$3:$O$101,11,FALSE)","v":0},{"v":131245100,"d":"131,245,100"},217.22,94.9]
[null,null,"하천사용료",null,{"$f":"VLOOKUP($C10,'[1]징수보고서(지난년도제외)'!$A$3:$O$101,4,FALSE)","v":{"v":18600,"d":"18,600"}},{"$f":"VLOOKUP($C10,'[1]징수보고서(지난년도제외)'!$A$3:$O$101,5,FALSE)","v":{"v":175893790,"d":"175,893,790"}},{"$f":"VLOOKUP($C10,'[1]징수보고서(지난년도제외)'!$A$3:$O$101,6,FALSE)","v":{"v":2724180,"d":"2,724,180"}},{"$f":"VLOOKUP($C10,'[1]징수보고서(지난년도제외)'!$A$3:$O$101,7,FALSE)","v":{"v":175742430,"d":"175,742,430"}},{"$f":"VLOOKUP($C10,'[1]징수보고서(지난년도제외)'!$A$3:$O$101,8,FALSE)","v":0},{"$f":"VLOOKUP($C10,'[1]징수보고서(지난년도제외)'!$A$3:$O$101,9,FALSE)","v":0},{"$f":"VLOOKUP($C10,'[1]징수보고서(지난년도제외)'!$A$3:$O$101,10,FALSE)","v":0},{"$f":"VLOOKUP($C10,'[1]징수보고서(지난년도제외)'!$A$3:$O$101,11,FALSE)","v":0},{"v":151360,"d":"151,360"},14646.13,99.91]
[null,null,"하수도사용료",null,{"$f":"VLOOKUP($C11,'[1]징수보고서(지난년도제외)'!$A$3:$O$101,4,FALSE)","v":0},{"$f":"VLOOKUP($C11,'[1]징수보고서(지난년도제외)'!$A$3:$O$101,5,FALSE)","v":0},{"$f":"VLOOKUP($C11,'[1]징수보고서(지난년도제외)'!$A$3:$O$101,6,FALSE)","v":0},{"$f":"VLOOKUP($C11,'[1]징수보고서(지난년도제외)'!$A$3:$O$101,7,FALSE)","v":0},{"$f":"VLOOKUP($C11,'[1]징수보고서(지난년도제외)'!$A$3:$O$101,8,FALSE)","v":0},{"$f":"VLOOKUP($C11,'[1]징수보고서(지난년도제외)'!$A$3:$O$101,9,FALSE)","v":0},{"$f":"VLOOKUP($C11,'[1]징수보고서(지난년도제외)'!$A$3:$O$101,10,FALSE)","v":0},{"$f":"VLOOKUP($C11,'[1]징수보고서(지난년도제외)'!$A$3:$O$101,11,FALSE)","v":0},0,{"$error":"#DIV/0!"},{"$error":"#DIV/0!"}]
[null,null,"상수도사용료",null,{"$f":"VLOOKUP($C12,'[1]징수보고서(지난년도제외)'!$A$3:$O$101,4,FALSE)","v":{"v":99880,"d":"99,880"}},{"$f":"VLOOKUP($C12,'[1]징수보고서(지난년도제외)'!$A$3:$O$101,5,FALSE)","v":{"v":1500740,"d":"1,500,740"}},{"$f":"VLOOKUP($C12,'[1]징수보고서(지난년도제외)'!$A$3:$O$101,6,FALSE)","v":{"v":99880,"d":"99,880"}},{"$f":"VLOOKUP($C12,'[1]징수보고서(지난년도제외)'!$A$3:$O$101,7,FALSE)","v":{"v":1497720,"d":"1,497,720"}},{"$f":"VLOOKUP($C12,'[1]징수보고서(지난년도제외)'!$A$3:$O$101,8,FALSE)","v":0},{"$f":"VLOOKUP($C12,'[1]징수보고서(지난년도제외)'!$A$3:$O$101,9,FALSE)","v":0},{"$f":"VLOOKUP($C12,'[1]징수보고서(지난년도제외)'!$A$3:$O$101,10,FALSE)","v":0},{"$f":"VLOOKUP($C12,'[1]징수보고서(지난년도제외)'!$A$3:$O$101,11,FALSE)","v":0},{"v":3020,"d":"3,020"},100,99.8]
[null,null,"공유수면사용료",null,{"$f":"VLOOKUP($C13,'[1]징수보고서(지난년도제외)'!$A$3:$O$101,4,FALSE)","v":{"v":234670,"d":"234,670"}},{"$f":"VLOOKUP($C13,'[1]징수보고서(지난년도제외)'!$A$3:$O$101,5,FALSE)","v":{"v":501721310,"d":"501,721,310"}},{"$f":"VLOOKUP($C13,'[1]징수보고서(지난년도제외)'!$A$3:$O$101,6,FALSE)","v":{"v":2054210,"d":"2,054,210"}},{"$f":"VLOOKUP($C13,'[1]징수보고서(지난년도제외)'!$A$3:$O$101,7,FALSE)","v":{"v":452321500,"d":"452,321,500"}},{"$f":"VLOOKUP($C13,'[1]징수보고서(지난년도제외)'!$A$3:$O$101,8,FALSE)","v":{"v":14580,"d":"14,580"}},{"$f":"VLOOKUP($C13,'[1]징수보고서(지난년도제외)'!$A$3:$O$101,9,FALSE)","v":{"v":14580,"d":"14,580"}},{"$f":"VLOOKUP($C13,'[1]징수보고서(지난년도제외)'!$A$3:$O$101,10,FALSE)","v":0},{"$f":"VLOOKUP($C13,'[1]징수보고서(지난년도제외)'!$A$3:$O$101,11,FALSE)","v":0},{"v":49399810,"d":"49,399,810"},875.36,90.15]
[null,null,"시장사용료",null,{"$f":"VLOOKUP($C14,'[1]징수보고서(지난년도제외)'!$A$3:$O$101,4,FALSE)","v":{"v":8506350,"d":"8,506,350"}},{"$f":"VLOOKUP($C14,'[1]징수보고서(지난년도제외)'!$A$3:$O$101,5,FALSE)","v":{"v":58869600,"d":"58,869,600"}},{"$f":"VLOOKUP($C14,'[1]징수보고서(지난년도제외)'!$A$3:$O$101,6,FALSE)","v":{"v":8506350,"d":"8,506,350"}},{"$f":"VLOOKUP($C14,'[1]징수보고서(지난년도제외)'!$A$3:$O$101,7,FALSE)","v":{"v":58869600,"d":"58,869,600"}},{"$f":"VLOOKUP($C14,'[1]징수보고서(지난년도제외)'!$A$3:$O$101,8,FALSE)","v":0},{"$f":"VLOOKUP($C14,'[1]징수보고서(지난년도제외)'!$A$3:$O$101,9,FALSE)","v":0},{"$f":"VLOOKUP($C14,'[1]징수보고서(지난년도제외)'!$A$3:$O$101,10,FALSE)","v":0},{"$f":"VLOOKUP($C14,'[1]징수보고서(지난년도제외)'!$A$3:$O$101,11,FALSE)","v":0},0,100,100]
[null,null,"입장료수입",null,{"$f":"VLOOKUP($C15,'[1]징수보고서(지난년도제외)'!$A$3:$O$101,4,FALSE)","v":{"v":3928000,"d":"3,928,000"}},{"$f":"VLOOKUP($C15,'[1]징수보고서(지난년도제외)'!$A$3:$O$101,5,FALSE)","v":{"v":7039000,"d":"7,039,000"}},{"$f":"VLOOKUP($C15,'[1]징수보고서(지난년도제외)'!$A$3:$O$101,6,FALSE)","v":{"v":1704000,"d":"1,704,000"}},{"$f":"VLOOKUP($C15,'[1]징수보고서(지난년도제외)'!$A$3:$O$101,7,FALSE)","v":{"v":4815000,"d":"4,815,000"}},{"$f":"VLOOKUP($C15,'[1]징수보고서(지난년도제외)'!$A$3:$O$101,8,FALSE)","v":0},{"$f":"VLOOKUP($C15,'[1]징수보고서(지난년도제외)'!$A$3:$O$101,9,FALSE)","v":0},{"$f":"VLOOKUP($C15,'[1]징수보고서(지난년도제외)'!$A$3:$O$101,10,FALSE)","v":0},{"$f":"VLOOKUP($C15,'[1]징수보고서(지난년도제외)'!$A$3:$O$101,11,FALSE)","v":0},{"v":2224000,"d":"2,224,000"},43.38,68.4]
[null,null,"주차요금수입",null,{"$f":"VLOOKUP($C16,'[1]징수보고서(지난년도제외)'!$A$3:$O$101,4,FALSE)","v":{"v":22622100,"d":"22,622,100"}},{"$f":"VLOOKUP($C16,'[1]징수보고서(지난년도제외)'!$A$3:$O$101,5,FALSE)","v":{"v":258726380,"d":"258,726,380"}},{"$f":"VLOOKUP($C16,'[1]징수보고서(지난년도제외)'!$A$3:$O$101,6,FALSE)","v":{"v":22622100,"d":"22,622,100"}},{"$f":"VLOOKUP($C16,'[1]징수보고서(지난년도제외)'!$A$3:$O$101,7,FALSE)","v":{"v":258726380,"d":"258,726,380"}},{"$f":"VLOOKUP($C16,'[1]징수보고서(지난년도제외)'!$A$3:$O$101,8,FALSE)","v":0},{"$f":"VLOOKUP($C16,'[1]징수보고서(지난년도제외)'!$A$3:$O$101,9,FALSE)","v":0},{"$f":"VLOOKUP($C16,'[1]징수보고서(지난년도제외)'!$A$3:$O$101,10,FALSE)","v":0},{"$f":"VLOOKUP($C16,'[1]징수보고서(지난년도제외)'!$A$3:$O$101,11,FALSE)","v":0},0,100,100]
[null,null,"기타사용료",null,{"$f":"VLOOKUP($C17,'[1]징수보고서(지난년도제외)'!$A$3:$O$101,4,FALSE)","v":{"v":376065890,"d":"376,065,890"}},{"$f":"VLOOKUP($C17,'[1]징수보고서(지난년도제외)'!$A$3:$O$101,5,FALSE)","v":{"v":4945455015,"d":"4,945,455,015"}},{"$f":"VLOOKUP($C17,'[1]징수보고서(지난년도제외)'!$A$3:$O$101,6,FALSE)","v":{"v":450206850,"d":"450,206,850"}},{"$f":"VLOOKUP($C17,'[1]징수보고서(지난년도제외)'!$A$3:$O$101,7,FALSE)","v":{"v":4893088665,"d":"4,893,088,665"}},{"$f":"VLOOKUP($C17,'[1]징수보고서(지난년도제외)'!$A$3:$O$101,8,FALSE)","v":{"v":4950250,"d":"4,950,250"}},{"$f":"VLOOKUP($C17,'[1]징수보고서(지난년도제외)'!$A$3:$O$101,9,FALSE)","v":{"v":53837710,"d":"53,837,710"}},{"$f":"VLOOKUP($C17,'[1]징수보고서(지난년도제외)'!$A$3:$O$101,10,FALSE)","v":0},{"$f":"VLOOKUP($C17,'[1]징수보고서(지난년도제외)'!$A$3:$O$101,11,FALSE)","v":0},{"v":52366350,"d":"52,366,350"},119.71,98.94]
[null,"수수료수입","증지수입",null,{"$f":"VLOOKUP($C18,'[1]징수보고서(지난년도제외)'!$A$3:$O$101,4,FALSE)","v":{"v":62407780,"d":"62,407,780"}},{"$f":"VLOOKUP($C18,'[1]징수보고서(지난년도제외)'!$A$3:$O$101,5,FALSE)","v":{"v":708208280,"d":"708,208,280"}},{"$f":"VLOOKUP($C18,'[1]징수보고서(지난년도제외)'!$A$3:$O$101,6,FALSE)","v":{"v":62886920,"d":"62,886,920"}},{"$f":"VLOOKUP($C18,'[1]징수보고서(지난년도제외)'!$A$3:$O$101,7,FALSE)","v":{"v":707065520,"d":"707,065,520"}},{"$f":"VLOOKUP($C18,'[1]징수보고서(지난년도제외)'!$A$3:$O$101,8,FALSE)","v":800},{"$f":"VLOOKUP($C18,'[1]징수보고서(지난년도제외)'!$A$3:$O$101,9,FALSE)","v":{"v":125200,"d":"125,200"}},{"$f":"VLOOKUP($C18,'[1]징수보고서(지난년도제외)'!$A$3:$O$101,10,FALSE)","v":0},{"$f":"VLOOKUP($C18,'[1]징수보고서(지난년도제외)'!$A$3:$O$101,11,FALSE)","v":0},{"v":1142760,"d":"1,142,760"},100.77,99.84]
[null,null,"폐기물처리수수료",null,{"$f":"VLOOKUP($C19,'[1]징수보고서(지난년도제외)'!$A$3:$O$101,4,FALSE)","v":{"v":633534070,"d":"633,534,070"}},{"$f":"VLOOKUP($C19,'[1]징수보고서(지난년도제외)'!$A$3:$O$101,5,FALSE)","v":{"v":7280194540,"d":"7,280,194,540"}},{"$f":"VLOOKUP($C19,'[1]징수보고서(지난년도제외)'!$A$3:$O$101,6,FALSE)","v":{"v":638705900,"d":"638,705,900"}},{"$f":"VLOOKUP($C19,'[1]징수보고서(지난년도제외)'!$A$3:$O$101,7,FALSE)","v":{"v":7274654790,"d":"7,274,654,790"}},{"$f":"VLOOKUP($C19,'[1]징수보고서(지난년도제외)'!$A$3:$O$101,8,FALSE)","v":0},{"$f":"VLOOKUP($C19,'[1]징수보고서(지난년도제외)'!$A$3:$O$101,9,FALSE)","v":{"v":396780,"d":"396,780"}},{"$f":"VLOOKUP($C19,'[1]징수보고서(지난년도제외)'!$A$3:$O$101,10,FALSE)","v":0},{"$f":"VLOOKUP($C19,'[1]징수보고서(지난년도제외)'!$A$3:$O$101,11,FALSE)","v":0},{"v":5539750,"d":"5,539,750"},100.82,99.92]
[null,null,"재활용품수거판매수입",null,{"$f":"VLOOKUP($C20,'[1]징수보고서(지난년도제외)'!$A$3:$O$101,4,FALSE)","v":{"v":13671000,"d":"13,671,000"}},{"$f":"VLOOKUP($C20,'[1]징수보고서(지난년도제외)'!$A$3:$O$101,5,FALSE)","v":{"v":222102850,"d":"222,102,850"}},{"$f":"VLOOKUP($C20,'[1]징수보고서(지난년도제외)'!$A$3:$O$101,6,FALSE)","v":{"v":15169250,"d":"15,169,250"}},{"$f":"VLOOKUP($C20,'[1]징수보고서(지난년도제외)'!$A$3:$O$101,7,FALSE)","v":{"v":216091250,"d":"216,091,250"}},{"$f":"VLOOKUP($C20,'[1]징수보고서(지난년도제외)'!$A$3:$O$101,8,FALSE)","v":0},{"$f":"VLOOKUP($C20,'[1]징수보고서(지난년도제외)'!$A$3:$O$101,9,FALSE)","v":0},{"$f":"VLOOKUP($C20,'[1]징수보고서(지난년도제외)'!$A$3:$O$101,10,FALSE)","v":0},{"$f":"VLOOKUP($C20,'[1]징수보고서(지난년도제외)'!$A$3:$O$101,11,FALSE)","v":0},{"v":6011600,"d":"6,011,600"},110.96,97.29]
[null,null,"보건의료수수료",null,{"$f":"VLOOKUP($C21,'[1]징수보고서(지난년도제외)'!$A$3:$O$101,4,FALSE)","v":{"v":46044680,"d":"46,044,680"}},{"$f":"VLOOKUP($C21,'[1]징수보고서(지난년도제외)'!$A$3:$O$101,5,FALSE)","v":{"v":583412370,"d":"583,412,370"}},{"$f":"VLOOKUP($C21,'[1]징수보고서(지난년도제외)'!$A$3:$O$101,6,FALSE)","v":{"v":46164880,"d":"46,164,880"}},{"$f":"VLOOKUP($C21,'[1]징수보고서(지난년도제외)'!$A$3:$O$101,7,FALSE)","v":{"v":583272370,"d":"583,272,370"}},{"$f":"VLOOKUP($C21,'[1]징수보고서(지난년도제외)'!$A$3:$O$101,8,FALSE)","v":0},{"$f":"VLOOKUP($C21,'[1]징수보고서(지난년도제외)'!$A$3:$O$101,9,FALSE)","v":{"v":11460,"d":"11,460"}},{"$f":"VLOOKUP($C21,'[1]징수보고서(지난년도제외)'!$A$3:$O$101,10,FALSE)","v":0},{"$f":"VLOOKUP($C21,'[1]징수보고서(지난년도제외)'!$A$3:$O$101,11,FALSE)","v":0},{"v":140000,"d":"140,000"},100.26,99.98]
[null,null,"기타수수료",null,{"$f":"VLOOKUP($C22,'[1]징수보고서(지난년도제외)'!$A$3:$O$101,4,FALSE)","v":{"v":45797480,"d":"45,797,480"}},{"$f":"VLOOKUP($C22,'[1]징수보고서(지난년도제외)'!$A$3:$O$101,5,FALSE)","v":{"v":517534120,"d":"517,534,120"}},{"$f":"VLOOKUP($C22,'[1]징수보고서(지난년도제외)'!$A$3:$O$101,6,FALSE)","v":{"v":45635590,"d":"45,635,590"}},{"$f":"VLOOKUP($C22,'[1]징수보고서(지난년도제외)'!$A$3:$O$101,7,FALSE)","v":{"v":516064620,"d":"516,064,620"}},{"$f":"VLOOKUP($C22,'[1]징수보고서(지난년도제외)'!$A$3:$O$101,8,FALSE)","v":0},{"$f":"VLOOKUP($C22,'[1]징수보고서(지난년도제외)'!$A$3:$O$101,9,FALSE)","v":{"v":35000,"d":"35,000"}},{"$f":"VLOOKUP($C22,'[1]징수보고서(지난년도제외)'!$A$3:$O$101,10,FALSE)","v":0},{"$f":"VLOOKUP($C22,'[1]징수보고서(지난년도제외)'!$A$3:$O$101,11,FALSE)","v":0},{"v":1469500,"d":"1,469,500"},99.65,99.72]
[null,"사업수입","사업장생산수입",null,{"$f":"VLOOKUP($C23,'[1]징수보고서(지난년도제외)'!$A$3:$O$101,4,FALSE)","v":{"v":106933100,"d":"106,933,100"}},{"$f":"VLOOKUP($C23,'[1]징수보고서(지난년도제외)'!$A$3:$O$101,5,FALSE)","v":{"v":1163418610,"d":"1,163,418,610"}},{"$f":"VLOOKUP($C23,'[1]징수보고서(지난년도제외)'!$A$3:$O$101,6,FALSE)","v":{"v":101345300,"d":"101,345,300"}},{"$f":"VLOOKUP($C23,'[1]징수보고서(지난년도제외)'!$A$3:$O$101,7,FALSE)","v":{"v":1157830810,"d":"1,157,830,810"}},{"$f":"VLOOKUP($C23,'[1]징수보고서(지난년도제외)'!$A$3:$O$101,8,FALSE)","v":0},{"$f":"VLOOKUP($C23,'[1]징수보고서(지난년도제외)'!$A$3:$O$101,9,FALSE)","v":0},{"$f":"VLOOKUP($C23,'[1]징수보고서(지난년도제외)'!$A$3:$O$101,10,FALSE)","v":0},{"$f":"VLOOKUP($C23,'[1]징수보고서(지난년도제외)'!$A$3:$O$101,11,FALSE)","v":0},{"v":5587800,"d":"5,587,800"},94.77,99.52]
[null,null,"청산금수입",null,{"$f":"VLOOKUP($C24,'[1]징수보고서(지난년도제외)'!$A$3:$O$101,4,FALSE)","v":0},{"$f":"VLOOKUP($C24,'[1]징수보고서(지난년도제외)'!$A$3:$O$101,5,FALSE)","v":0},{"$f":"VLOOKUP($C24,'[1]징수보고서(지난년도제외)'!$A$3:$O$101,6,FALSE)","v":0},{"$f":"VLOOKUP($C24,'[1]징수보고서(지난년도제외)'!$A$3:$O$101,7,FALSE)","v":0},{"$f":"VLOOKUP($C24,'[1]징수보고서(지난년도제외)'!$A$3:$O$101,8,FALSE)","v":0},{"$f":"VLOOKUP($C24,'[1]징수보고서(지난년도제외)'!$A$3:$O$101,9,FALSE)","v":0},{"$f":"VLOOKUP($C24,'[1]징수보고서(지난년도제외)'!$A$3:$O$101,10,FALSE)","v":0},{"$f":"VLOOKUP($C24,'[1]징수보고서(지난년도제외)'!$A$3:$O$101,11,FALSE)","v":0},0,{"$error":"#DIV/0!"},{"$error":"#DIV/0!"}]
[null,null,"매각사업수입",null,{"$f":"VLOOKUP($C25,'[1]징수보고서(지난년도제외)'!$A$3:$O$101,4,FALSE)","v":0},{"$f":"VLOOKUP($C25,'[1]징수보고서(지난년도제외)'!$A$3:$O$101,5,FALSE)","v":0},{"$f":"VLOOKUP($C25,'[1]징수보고서(지난년도제외)'!$A$3:$O$101,6,FALSE)","v":0},{"$f":"VLOOKUP($C25,'[1]징수보고서(지난년도제외)'!$A$3:$O$101,7,FALSE)","v":0},{"$f":"VLOOKUP($C25,'[1]징수보고서(지난년도제외)'!$A$3:$O$101,8,FALSE)","v":0},{"$f":"VLOOKUP($C25,'[1]징수보고서(지난년도제외)'!$A$3:$O$101,9,FALSE)","v":0},{"$f":"VLOOKUP($C25,'[1]징수보고서(지난년도제외)'!$A$3:$O$101,10,FALSE)","v":0},{"$f":"VLOOKUP($C25,'[1]징수보고서(지난년도제외)'!$A$3:$O$101,11,FALSE)","v":0},0,{"$error":"#DIV/0!"},{"$error":"#DIV/0!"}]
[null,null,"배당금수입",null,{"$f":"VLOOKUP($C26,'[1]징수보고서(지난년도제외)'!$A$3:$O$101,4,FALSE)","v":0},{"$f":"VLOOKUP($C26,'[1]징수보고서(지난년도제외)'!$A$3:$O$101,5,FALSE)","v":0},{"$f":"VLOOKUP($C26,'[1]징수보고서(지난년도제외)'!$A$3:$O$101,6,FALSE)","v":0},{"$f":"VLOOKUP($C26,'[1]징수보고서(지난년도제외)'!$A$3:$O$101,7,FALSE)","v":0},{"$f":"VLOOKUP($C26,'[1]징수보고서(지난년도제외)'!$A$3:$O$101,8,FALSE)","v":0},{"$f":"VLOOKUP($C26,'[1]징수보고서(지난년도제외)'!$A$3:$O$101,9,FALSE)","v":0},{"$f":"VLOOKUP($C26,'[1]징수보고서(지난년도제외)'!$A$3:$O$101,10,FALSE)","v":0},{"$f":"VLOOKUP($C26,'[1]징수보고서(지난년도제외)'!$A$3:$O$101,11,FALSE)","v":0},0,{"$error":"#DIV/0!"},{"$error":"#DIV/0!"}]
[null,null,"기타사업수입",null,{"$f":"VLOOKUP($C27,'[1]징수보고서(지난년도제외)'!$A$3:$O$101,4,FALSE)","v":{"v":1741000,"d":"1,741,000"}},{"$f":"VLOOKUP($C27,'[1]징수보고서(지난년도제외)'!$A$3:$O$101,5,FALSE)","v":{"v":10976880,"d":"10,976,880"}},{"$f":"VLOOKUP($C27,'[1]징수보고서(지난년도제외)'!$A$3:$O$101,6,FALSE)","v":{"v":1763000,"d":"1,763,000"}},{"$f":"VLOOKUP($C27,'[1]징수보고서(지난년도제외)'!$A$3:$O$101,7,FALSE)","v":{"v":10960380,"d":"10,960,380"}},{"$f":"VLOOKUP($C27,'[1]징수보고서(지난년도제외)'!$A$3:$O$101,8,FALSE)","v":{"v":5500,"d":"5,500"}},{"$f":"VLOOKUP($C27,'[1]징수보고서(지난년도제외)'!$A$3:$O$101,9,FALSE)","v":{"v":5500,"d":"5,500"}},{"$f":"VLOOKUP($C27,'[1]징수보고서(지난년도제외)'!$A$3:$O$101,10,FALSE)","v":0},{"$f":"VLOOKUP($C27,'[1]징수보고서(지난년도제외)'!$A$3:$O$101,11,FALSE)","v":0},{"v":16500,"d":"16,500"},101.26,99.85]
[null,"징수교부금수입","징수교부금수입",null,{"$f":"VLOOKUP($C28,'[1]징수보고서(지난년도제외)'!$A$3:$O$101,4,FALSE)","v":{"v":588367490,"d":"588,367,490"}},{"$f":"VLOOKUP($C28,'[1]징수보고서(지난년도제외)'!$A$3:$O$101,5,FALSE)","v":{"v":3155348140,"d":"3,155,348,140"}},{"$f":"VLOOKUP($C28,'[1]징수보고서(지난년도제외)'!$A$3:$O$101,6,FALSE)","v":{"v":588367490,"d":"588,367,490"}},{"$f":"VLOOKUP($C28,'[1]징수보고서(지난년도제외)'!$A$3:$O$101,7,FALSE)","v":{"v":3155348140,"d":"3,155,348,140"}},{"$f":"VLOOKUP($C28,'[1]징수보고서(지난년도제외)'!$A$3:$O$101,8,FALSE)","v":0},{"$f":"VLOOKUP($C28,'[1]징수보고서(지난년도제외)'!$A$3:$O$101,9,FALSE)","v":0},{"$f":"VLOOKUP($C28,'[1]징수보고서(지난년도제외)'!$A$3:$O$101,10,FALSE)","v":0},{"$f":"VLOOKUP($C28,'[1]징수보고서(지난년도제외)'!$A$3:$O$101,11,FALSE)","v":0},0,100,100]
[null,"이자수입　","공공예금이자수입",null,{"$f":"VLOOKUP($C29,'[1]징수보고서(지난년도제외)'!$A$3:$O$101,4,FALSE)","v":{"v":1088274660,"d":"1,088,274,660"}},{"$f":"VLOOKUP($C29,'[1]징수보고서(지난년도제외)'!$A$3:$O$101,5,FALSE)","v":{"v":8867696700,"d":"8,867,696,700"}},{"$f":"VLOOKUP($C29,'[1]징수보고서(지난년도제외)'!$A$3:$O$101,6,FALSE)","v":{"v":1088274660,"d":"1,088,274,660"}},{"$f":"VLOOKUP($C29,'[1]징수보고서(지난년도제외)'!$A$3:$O$101,7,FALSE)","v":{"v":8867696700,"d":"8,867,696,700"}},{"$f":"VLOOKUP($C29,'[1]징수보고서(지난년도제외)'!$A$3:$O$101,8,FALSE)","v":0},{"$f":"VLOOKUP($C29,'[1]징수보고서(지난년도제외)'!$A$3:$O$101,9,FALSE)","v":0},{"$f":"VLOOKUP($C29,'[1]징수보고서(지난년도제외)'!$A$3:$O$101,10,FALSE)","v":0},{"$f":"VLOOKUP($C29,'[1]징수보고서(지난년도제외)'!$A$3:$O$101,11,FALSE)","v":0},0,100,100]
[null,null,"융자금회수이자수입",null,{"$f":"VLOOKUP($C30,'[1]징수보고서(지난년도제외)'!$A$3:$O$101,4,FALSE)","v":0},{"$f":"VLOOKUP($C30,'[1]징수보고서(지난년도제외)'!$A$3:$O$101,5,FALSE)","v":0},{"$f":"VLOOKUP($C30,'[1]징수보고서(지난년도제외)'!$A$3:$O$101,6,FALSE)","v":0},{"$f":"VLOOKUP($C30,'[1]징수보고서(지난년도제외)'!$A$3:$O$101,7,FALSE)","v":0},{"$f":"VLOOKUP($C30,'[1]징수보고서(지난년도제외)'!$A$3:$O$101,8,FALSE)","v":0},{"$f":"VLOOKUP($C30,'[1]징수보고서(지난년도제외)'!$A$3:$O$101,9,FALSE)","v":0},{"$f":"VLOOKUP($C30,'[1]징수보고서(지난년도제외)'!$A$3:$O$101,10,FALSE)","v":0},{"$f":"VLOOKUP($C30,'[1]징수보고서(지난년도제외)'!$A$3:$O$101,11,FALSE)","v":0},0,{"$error":"#DIV/0!"},{"$error":"#DIV/0!"}]
{"$rows_left_out":39}
{"sheet":"Sheet1","index":1,"n_rows":0,"n_cols":0,"rows_kept":0}